Jump to content

Search the Community

Showing results for tags 'ruby on rails'.



More search options

  • Search By Tags

    Type tags separated by commas.
  • Search By Author

Content Type


Forums

  • Q&A Desenvolvimento
    • Perguntas e respostas rápidas
  • Desenvolvimento e Banco de Dados
    • HTML e CSS
    • Java
    • Javascript
    • .NET
    • PHP
    • Python
    • Ruby
    • Mobile
    • Ambientes de Desenvolvimento
    • Arquitetura e Métodos Ágeis
    • Banco de Dados
    • DevOps
    • Desenvolvimento de Games
    • E-Commerce e Pagamentos Online
    • SEO e Otimizações
    • WordPress
    • Algoritmos & Outras Tecnologias
  • Design e Produto
    • Fotografia
    • Photoshop
    • Design de interfaces e UX
    • Edição/Produção de Vídeos
    • Marketing Online
    • Desenho, Ilustração e 3D
  • Entretenimento e uso pessoal
    • Geral
    • Segurança & Malwares
    • Gadgets e wearable
    • Softwares e Apps
    • Entretenimento

Find results in...

Find results that contain...


Date Created

  • Start

    End


Last Updated

  • Start

    End


Filter by number of...

Joined

  • Start

    End


Group


Google+


Hangouts


Skype


Twitter


deviantART


Github


Flickr


LinkedIn


Pinterest


Facebook


Site Pessoal


Localização


Interesses

Found 3 results

  1. Por favor, preciso de ajuda da comunidade Ruby. Sou recém chegado na linguagem Ruby e no framework Rails. Estou participando da Campus Code e não consigo progredir em um desafio proposto no treinamento. O repositório do projeto baixei em minha máquina virtual VMware com Ubuntu 18.04 e nele consta o projeto em Ruby on Rails e os testes para passar com rspec. Eis os arquivos sensíveis para concluir o projeto: home_controller.rb: class HomeController < ApplicationController def page @recipes = Recipe.all end end page.html.erb: <% if recipes == [] %> <h1>CookBook</h1> <p>Bem-vindo ao maior livro de receitas online</p> <% else %> <% @recipes.each do |recipe| %> <h1><%= recipe.title %></h1> <li><%= recipe.recipe_type %></li> <li><%= recipe.cuisine %></li> <li><%= recipe.difficulty %></li> <li><%= recipe.cook_time %> minutos</li> <% end %> <% end %> recipe.rb: class Recipe < ApplicationRecord end routes.rb: Rails.application.routes.draw do root to: 'home#page' resources :recipe end E esse é o arquivo de testes visitor_visit_homepage_spec.rb: require 'rails_helper' feature 'Visitor visit homepage' do scenario 'successfully' do visit root_path expect(page).to have_css('h1', text: 'CookBook') expect(page).to have_css('p', text: 'Bem-vindo ao maior livro de receitas'\ ' online') end scenario 'and view recipe' do #cria os dados necessários recipe = Recipe.create(title: 'Bolo de cenoura', recipe_type: 'Sobremesa', cuisine: 'Brasileira', difficulty: 'Médio', cook_time: 60) # simula a ação do usuário visit root_path # expectativas do usuário após a ação expect(page).to have_css('h1', text: recipe.title) expect(page).to have_css('li', text: recipe.recipe_type) expect(page).to have_css('li', text: recipe.cuisine) expect(page).to have_css('li', text: recipe.difficulty) expect(page).to have_css('li', text: "#{recipe.cook_time} minutos") end scenario 'and view recipes list' do #cria os dados necessários recipe = Recipe.create(title: 'Bolo de cenoura', recipe_type: 'Sobremesa', cuisine: 'Brasileira', difficulty: 'Médio', cook_time: 60) another_recipe = Recipe.create(title: 'Feijoada', recipe_type: 'Prato Principal', cuisine: 'Brasileira', difficulty: 'Difícil', cook_time: 90) # simula a ação do usuário visit root_path # expectativas do usuário após a ação expect(page).to have_css('h1', text: recipe.title) expect(page).to have_css('li', text: recipe.recipe_type) expect(page).to have_css('li', text: recipe.cuisine) expect(page).to have_css('li', text: recipe.difficulty) expect(page).to have_css('li', text: "#{recipe.cook_time} minutos") expect(page).to have_css('h1', text: another_recipe.title) expect(page).to have_css('li', text: another_recipe.recipe_type) expect(page).to have_css('li', text: another_recipe.cuisine) expect(page).to have_css('li', text: another_recipe.difficulty) expect(page).to have_css('li', text: "#{another_recipe.cook_time} minutos") end end Passo o comando rspec na pasta do projeto: :~/workspace/cookbook_parte2$ rspec Visitor visit homepage successfully (FAILED - 1) and view recipe (FAILED - 2) and view recipes list (FAILED - 3) Recipe add some examples to (or delete) /home/massa-90/workspace/cookbook_parte2/spec/models/recipe_spec.rb (PENDING: Not yet implemented) Pending: (Failures listed here are expected and do not affect your suite's status) 1) Recipe add some examples to (or delete) /home/massa-90/workspace/cookbook_parte2/spec/models/recipe_spec.rb # Not yet implemented # ./spec/models/recipe_spec.rb:4 Failures: 1) Visitor visit homepage successfully Failure/Error: <% if recipes == [] %> ActionView::Template::Error: undefined local variable or method `recipes' for #<#<Class:0x0000564c2a9f8630>:0x0000564c2a9f30b8> Did you mean? @recipes # ./app/views/home/page.html.erb:1:in `_app_views_home_page_html_erb___526898541735595527_47442566303380' # ./spec/features/visitor_visit_homepage_spec.rb:5:in `block (2 levels) in <top (required)>' # ------------------ # --- Caused by: --- # NameError: # undefined local variable or method `recipes' for #<#<Class:0x0000564c2a9f8630>:0x0000564c2a9f30b8> # Did you mean? @recipes # ./app/views/home/page.html.erb:1:in `_app_views_home_page_html_erb___526898541735595527_47442566303380' 2) Visitor visit homepage and view recipe Failure/Error: <% if recipes == [] %> ActionView::Template::Error: undefined local variable or method `recipes' for #<#<Class:0x0000564c2a9f8630>:0x0000564c2a68c0c8> Did you mean? @recipes # ./app/views/home/page.html.erb:1:in `_app_views_home_page_html_erb___526898541735595527_47442566303380' # ./spec/features/visitor_visit_homepage_spec.rb:19:in `block (2 levels) in <top (required)>' # ------------------ # --- Caused by: --- # NameError: # undefined local variable or method `recipes' for #<#<Class:0x0000564c2a9f8630>:0x0000564c2a68c0c8> # Did you mean? @recipes # ./app/views/home/page.html.erb:1:in `_app_views_home_page_html_erb___526898541735595527_47442566303380' 3) Visitor visit homepage and view recipes list Failure/Error: <% if recipes == [] %> ActionView::Template::Error: undefined local variable or method `recipes' for #<#<Class:0x0000564c2a9f8630>:0x0000564c2a4b2cc0> Did you mean? @recipes # ./app/views/home/page.html.erb:1:in `_app_views_home_page_html_erb___526898541735595527_47442566303380' # ./spec/features/visitor_visit_homepage_spec.rb:41:in `block (2 levels) in <top (required)>' # ------------------ # --- Caused by: --- # NameError: # undefined local variable or method `recipes' for #<#<Class:0x0000564c2a9f8630>:0x0000564c2a4b2cc0> # Did you mean? @recipes # ./app/views/home/page.html.erb:1:in `_app_views_home_page_html_erb___526898541735595527_47442566303380' Finished in 0.34634 seconds (files took 2.17 seconds to load) 4 examples, 3 failures, 1 pending Failed examples: rspec ./spec/features/visitor_visit_homepage_spec.rb:4 # Visitor visit homepage successfully rspec ./spec/features/visitor_visit_homepage_spec.rb:12 # Visitor visit homepage and view recipe rspec ./spec/features/visitor_visit_homepage_spec.rb:29 # Visitor visit homepage and view recipes list E para criar a model recipe na linha do terminal e executar a migration criada em db/migrations: $ rails generate model recipe title:string recipe_type:string cuisine:string difficulty:string cook_time:string invoke active_record create db/migrate/20191016221038_create_recipes.rb create app/models/recipe.rb invoke rspec create spec/models/recipe_spec.rb $ rspec Migrations are pending. To resolve this issue, run: bin/rails db:migrate RAILS_ENV=test $ cd bin $ rails db:migrate RAILS_ENV=test== 20191016221038 CreateRecipes: migrating ==================================== -- create_table(:recipes) -> 0.0029s == 20191016221038 CreateRecipes: migrated (0.0035s) =========================== O que pode ser alterado nos códigos do projeto que eu não saiba? Aguardo sua resposta. Obrigado, Marcelino
  2. breno2019

    Ajuda ruby on rails: salvar sessão

    Eu tenho uma tabela Empresa e outra tabela Usuário, a chave estrangeira da empresa está no usuário pois uma empresa possui vários usuários. E eu pretendo usar a gem DEVISE na tabela de empresa para que só quem pode cadastrar um novo usuário seja quem está logado, pra isso, dentro do cadastro usuário vou mandar o id da empresa que esta logada, pro cadastro do usuário, ou seja vou mandar o id direto quando clicar em cadastrar, não vou escolher a empresa.OBS: creio que eu tenha que guardar as informações da empresa logada numa sessão, daí no momento do cadastro de usuário, mandar o id da empresa. A lógica é essa, mas como faço isso? pois sou novo no rails e não conheço todos os recursos do framework.
  3. wanderson Luan

    maquina virtual, com problema.

    olá pessoal, estou com um problema, na minha maquina virtual, pois quando levanto a aplicação, não sobe para a web, com o localhost:3000. e ele está criando um erro gigantesco, e saindo quando dou o comando rails s -b 0.0.0.0 no meu terminal. nesse caso estou usando o "foreman start". vagrant@precise32:/vagrant/escamboapp$ foreman start 18:11:26 web.1 | started with pid 7947 18:11:57 web.1 | /home/vagrant/.rvm/gems/ruby-2.3.4/gems/activerecord-4.2.5/lib/active_record/dynamic_matchers.rb:26:in `method_missing': undefined method `devise' for Install (call 'Install.connection' to establish a connection):Class (NoMethodError) 18:11:57 web.1 | from /vagrant/escamboapp/app/models/install.rb:4:in `<class:Install>' 18:11:57 web.1 | from /vagrant/escamboapp/app/models/install.rb:1:in `<top (required)>' 18:11:57 web.1 | from /home/vagrant/.rvm/gems/ruby-2.3.4/gems/activesupport-4.2.5/lib/active_support/dependencies.rb:457:in `load' 18:11:57 web.1 | from /home/vagrant/.rvm/gems/ruby-2.3.4/gems/activesupport-4.2.5/lib/active_support/dependencies.rb:457:in `block in load_file' 18:11:57 web.1 | from /home/vagrant/.rvm/gems/ruby-2.3.4/gems/activesupport-4.2.5/lib/active_support/dependencies.rb:647:in `new_constants_in' 18:11:57 web.1 | from /home/vagrant/.rvm/gems/ruby-2.3.4/gems/activesupport-4.2.5/lib/active_support/dependencies.rb:456:in `load_file' 18:11:57 web.1 | from /home/vagrant/.rvm/gems/ruby-2.3.4/gems/activesupport-4.2.5/lib/active_support/dependencies.rb:354:in `require_or_load' 18:11:57 web.1 | from /home/vagrant/.rvm/gems/ruby-2.3.4/gems/activesupport-4.2.5/lib/active_support/dependencies.rb:494:in `load_missing_constant' 18:11:57 web.1 | from /home/vagrant/.rvm/gems/ruby-2.3.4/gems/activesupport-4.2.5/lib/active_support/dependencies.rb:184:in `const_missing' 18:11:57 web.1 | from /home/vagrant/.rvm/gems/ruby-2.3.4/gems/activesupport-4.2.5/lib/active_support/inflector/methods.rb:261:in `const_get' 18:11:57 web.1 | from /home/vagrant/.rvm/gems/ruby-2.3.4/gems/activesupport-4.2.5/lib/active_support/inflector/methods.rb:261:in `block in constantize' 18:11:57 web.1 | from /home/vagrant/.rvm/gems/ruby-2.3.4/gems/activesupport-4.2.5/lib/active_support/inflector/methods.rb:259:in `each' 18:11:57 web.1 | from /home/vagrant/.rvm/gems/ruby-2.3.4/gems/activesupport-4.2.5/lib/active_support/inflector/methods.rb:259:in `inject' 18:11:57 web.1 | from /home/vagrant/.rvm/gems/ruby-2.3.4/gems/activesupport-4.2.5/lib/active_support/inflector/methods.rb:259:in `constantize' 18:11:57 web.1 | from /home/vagrant/.rvm/gems/ruby-2.3.4/gems/activesupport-4.2.5/lib/active_support/dependencies.rb:566:in `get' 18:11:57 web.1 | from /home/vagrant/.rvm/gems/ruby-2.3.4/gems/activesupport-4.2.5/lib/active_support/dependencies.rb:597:in `constantize' 18:11:57 web.1 | from /home/vagrant/.rvm/gems/ruby-2.3.4/gems/devise-4.3.0/lib/devise.rb:313:in `get' 18:11:57 web.1 | from /home/vagrant/.rvm/gems/ruby-2.3.4/gems/devise-4.3.0/lib/devise/mapping.rb:81:in `to' 18:11:57 web.1 | from /home/vagrant/.rvm/gems/ruby-2.3.4/gems/devise-4.3.0/lib/devise/mapping.rb:76:in `modules' 18:11:57 web.1 | from /home/vagrant/.rvm/gems/ruby-2.3.4/gems/devise-4.3.0/lib/devise/mapping.rb:93:in `routes' 18:11:57 web.1 | from /home/vagrant/.rvm/gems/ruby-2.3.4/gems/devise-4.3.0/lib/devise/mapping.rb:160:in `default_used_route' 18:11:57 web.1 | from /home/vagrant/.rvm/gems/ruby-2.3.4/gems/devise-4.3.0/lib/devise/mapping.rb:70:in `initialize' 18:11:57 web.1 | from /home/vagrant/.rvm/gems/ruby-2.3.4/gems/devise-4.3.0/lib/devise.rb:343:in `new' 18:11:57 web.1 | from /home/vagrant/.rvm/gems/ruby-2.3.4/gems/devise-4.3.0/lib/devise.rb:343:in `add_mapping' 18:11:57 web.1 | from /home/vagrant/.rvm/gems/ruby-2.3.4/gems/devise-4.3.0/lib/devise/rails/routes.rb:241:in `block in devise_for' 18:11:57 web.1 | from /home/vagrant/.rvm/gems/ruby-2.3.4/gems/devise-4.3.0/lib/devise/rails/routes.rb:240:in `each' 18:11:57 web.1 | from /home/vagrant/.rvm/gems/ruby-2.3.4/gems/devise-4.3.0/lib/devise/rails/routes.rb:240:in `devise_for' 18:11:57 web.1 | from /vagrant/escamboapp/config/routes.rb:2:in `block in <top (required)>' 18:11:57 web.1 | from /home/vagrant/.rvm/gems/ruby-2.3.4/gems/actionpack-4.2.5/lib/action_dispatch/routing/route_set.rb:434:in `instance_exec' 18:11:57 web.1 | from /home/vagrant/.rvm/gems/ruby-2.3.4/gems/actionpack-4.2.5/lib/action_dispatch/routing/route_set.rb:434:in `eval_block' 18:11:57 web.1 | from /home/vagrant/.rvm/gems/ruby-2.3.4/gems/actionpack-4.2.5/lib/action_dispatch/routing/route_set.rb:412:in `draw' 18:11:57 web.1 | from /vagrant/escamboapp/config/routes.rb:1:in `<top (required)>' 18:11:57 web.1 | from /home/vagrant/.rvm/gems/ruby-2.3.4/gems/activesupport-4.2.5/lib/active_support/dependencies.rb:268:in `load' 18:11:57 web.1 | from /home/vagrant/.rvm/gems/ruby-2.3.4/gems/activesupport-4.2.5/lib/active_support/dependencies.rb:268:in `block in load' 18:11:57 web.1 | from /home/vagrant/.rvm/gems/ruby-2.3.4/gems/activesupport-4.2.5/lib/active_support/dependencies.rb:240:in `load_dependency' 18:11:57 web.1 | from /home/vagrant/.rvm/gems/ruby-2.3.4/gems/activesupport-4.2.5/lib/active_support/dependencies.rb:268:in `load' 18:11:57 web.1 | from /home/vagrant/.rvm/gems/ruby-2.3.4/gems/railties-4.2.5/lib/rails/application/routes_reloader.rb:40:in `block in load_paths' 18:11:57 web.1 | from /home/vagrant/.rvm/gems/ruby-2.3.4/gems/railties-4.2.5/lib/rails/application/routes_reloader.rb:40:in `each' 18:11:57 web.1 | from /home/vagrant/.rvm/gems/ruby-2.3.4/gems/railties-4.2.5/lib/rails/application/routes_reloader.rb:40:in `load_paths' 18:11:57 web.1 | from /home/vagrant/.rvm/gems/ruby-2.3.4/gems/railties-4.2.5/lib/rails/application/routes_reloader.rb:16:in `reload!' 18:11:57 web.1 | from /home/vagrant/.rvm/gems/ruby-2.3.4/gems/railties-4.2.5/lib/rails/application/routes_reloader.rb:26:in `block in updater' 18:11:57 web.1 | from /home/vagrant/.rvm/gems/ruby-2.3.4/gems/activesupport-4.2.5/lib/active_support/file_update_checker.rb:75:in `execute' 18:11:57 web.1 | from /home/vagrant/.rvm/gems/ruby-2.3.4/gems/railties-4.2.5/lib/rails/application/routes_reloader.rb:27:in `updater' 18:11:57 web.1 | from /home/vagrant/.rvm/gems/ruby-2.3.4/gems/railties-4.2.5/lib/rails/application/routes_reloader.rb:7:in `execute_if_updated' 18:11:57 web.1 | from /home/vagrant/.rvm/gems/ruby-2.3.4/gems/railties-4.2.5/lib/rails/application/finisher.rb:69:in `block in <module:Finisher>' 18:11:57 web.1 | from /home/vagrant/.rvm/gems/ruby-2.3.4/gems/railties-4.2.5/lib/rails/initializable.rb:30:in `instance_exec' 18:11:57 web.1 | from /home/vagrant/.rvm/gems/ruby-2.3.4/gems/railties-4.2.5/lib/rails/initializable.rb:30:in `run' 18:11:57 web.1 | from /home/vagrant/.rvm/gems/ruby-2.3.4/gems/railties-4.2.5/lib/rails/initializable.rb:55:in `block in run_initializers' 18:11:57 web.1 | from /usr/share/ruby-rvm/rubies/ruby-2.3.4/lib/ruby/2.3.0/tsort.rb:228:in `block in tsort_each' 18:11:57 web.1 | from /usr/share/ruby-rvm/rubies/ruby-2.3.4/lib/ruby/2.3.0/tsort.rb:350:in `block (2 levels) in each_strongly_connected_component' 18:11:57 web.1 | from /usr/share/ruby-rvm/rubies/ruby-2.3.4/lib/ruby/2.3.0/tsort.rb:431:in `each_strongly_connected_component_from' 18:11:57 web.1 | from /usr/share/ruby-rvm/rubies/ruby-2.3.4/lib/ruby/2.3.0/tsort.rb:349:in `block in each_strongly_connected_component' 18:11:57 web.1 | from /usr/share/ruby-rvm/rubies/ruby-2.3.4/lib/ruby/2.3.0/tsort.rb:347:in `each' 18:11:57 web.1 | from /usr/share/ruby-rvm/rubies/ruby-2.3.4/lib/ruby/2.3.0/tsort.rb:347:in `call' 18:11:57 web.1 | from /usr/share/ruby-rvm/rubies/ruby-2.3.4/lib/ruby/2.3.0/tsort.rb:347:in `each_strongly_connected_component' 18:11:57 web.1 | from /usr/share/ruby-rvm/rubies/ruby-2.3.4/lib/ruby/2.3.0/tsort.rb:226:in `tsort_each' 18:11:57 web.1 | from /usr/share/ruby-rvm/rubies/ruby-2.3.4/lib/ruby/2.3.0/tsort.rb:205:in `tsort_each' 18:11:57 web.1 | from /home/vagrant/.rvm/gems/ruby-2.3.4/gems/railties-4.2.5/lib/rails/initializable.rb:54:in `run_initializers' 18:11:57 web.1 | from /home/vagrant/.rvm/gems/ruby-2.3.4/gems/railties-4.2.5/lib/rails/application.rb:352:in `initialize!' 18:11:57 web.1 | from /vagrant/escamboapp/config/environment.rb:5:in `<top (required)>' 18:11:57 web.1 | from /home/vagrant/.rvm/gems/ruby-2.3.4/gems/activesupport-4.2.5/lib/active_support/dependencies.rb:274:in `require' 18:11:57 web.1 | from /home/vagrant/.rvm/gems/ruby-2.3.4/gems/activesupport-4.2.5/lib/active_support/dependencies.rb:274:in `block in require' 18:11:57 web.1 | from /home/vagrant/.rvm/gems/ruby-2.3.4/gems/activesupport-4.2.5/lib/active_support/dependencies.rb:240:in `load_dependency' 18:11:57 web.1 | from /home/vagrant/.rvm/gems/ruby-2.3.4/gems/activesupport-4.2.5/lib/active_support/dependencies.rb:274:in `require' 18:11:57 web.1 | from /vagrant/escamboapp/config.ru:3:in `block in <main>' 18:11:57 web.1 | from /home/vagrant/.rvm/gems/ruby-2.3.4/gems/rack-1.6.8/lib/rack/builder.rb:55:in `instance_eval' 18:11:57 web.1 | from /home/vagrant/.rvm/gems/ruby-2.3.4/gems/rack-1.6.8/lib/rack/builder.rb:55:in `initialize' 18:11:57 web.1 | from /vagrant/escamboapp/config.ru:in `new' 18:11:57 web.1 | from /vagrant/escamboapp/config.ru:in `<main>' 18:11:57 web.1 | from /home/vagrant/.rvm/gems/ruby-2.3.4/gems/rack-1.6.8/lib/rack/builder.rb:49:in `eval' 18:11:57 web.1 | from /home/vagrant/.rvm/gems/ruby-2.3.4/gems/rack-1.6.8/lib/rack/builder.rb:49:in `new_from_string' 18:11:57 web.1 | from /home/vagrant/.rvm/gems/ruby-2.3.4/gems/rack-1.6.8/lib/rack/builder.rb:40:in `parse_file' 18:11:57 web.1 | from /home/vagrant/.rvm/gems/ruby-2.3.4/gems/rack-1.6.8/lib/rack/server.rb:300:in `build_app_and_options_from_config' 18:11:57 web.1 | from /home/vagrant/.rvm/gems/ruby-2.3.4/gems/rack-1.6.8/lib/rack/server.rb:209:in `app' 18:11:57 web.1 | from /home/vagrant/.rvm/gems/ruby-2.3.4/gems/railties-4.2.5/lib/rails/commands/server.rb:61:in `app' 18:11:57 web.1 | from /home/vagrant/.rvm/gems/ruby-2.3.4/gems/rack-1.6.8/lib/rack/server.rb:337:in `wrapped_app' 18:11:57 web.1 | from /home/vagrant/.rvm/gems/ruby-2.3.4/gems/railties-4.2.5/lib/rails/commands/server.rb:139:in `log_to_stdout' 18:11:57 web.1 | from /home/vagrant/.rvm/gems/ruby-2.3.4/gems/railties-4.2.5/lib/rails/commands/server.rb:78:in `start' 18:11:57 web.1 | from /home/vagrant/.rvm/gems/ruby-2.3.4/gems/railties-4.2.5/lib/rails/commands/commands_tasks.rb:80:in `block in server' 18:11:57 web.1 | from /home/vagrant/.rvm/gems/ruby-2.3.4/gems/railties-4.2.5/lib/rails/commands/commands_tasks.rb:75:in `tap' 18:11:57 web.1 | from /home/vagrant/.rvm/gems/ruby-2.3.4/gems/railties-4.2.5/lib/rails/commands/commands_tasks.rb:75:in `server' 18:11:57 web.1 | from /home/vagrant/.rvm/gems/ruby-2.3.4/gems/railties-4.2.5/lib/rails/commands/commands_tasks.rb:39:in `run_command!' 18:11:57 web.1 | from /home/vagrant/.rvm/gems/ruby-2.3.4/gems/railties-4.2.5/lib/rails/commands.rb:17:in `<top (required)>' 18:11:57 web.1 | from bin/rails:4:in `require' 18:11:57 web.1 | from bin/rails:4:in `<main>' 18:11:57 web.1 | => Booting WEBrick 18:11:57 web.1 | => Rails 4.2.5 application starting in development on http://0.0.0.0:3000 18:11:57 web.1 | => Run `rails server -h` for more startup options 18:11:57 web.1 | => Ctrl-C to shutdown server 18:11:57 web.1 | Exiting 18:11:57 web.1 | exited with code 1 18:11:57 system | sending SIGTERM to all processes Agradeço desde já!
×

Important Information

Ao usar o fórum, você concorda com nossos Terms of Use.